Magnus Hirschfeld
type: Concept
broader: key people in gender and society
definition: Born in 1868 to Jewish parents in Kolberg, a Prussian town on the Baltic coast, Magnus Hirschfeld became an important theorist of sexuality and the most prominent advocate of homosexual emancipation at the beginning of the 20th century. He first studied modern languages and then medicine, obtaning his degree in 1892. [Source: Encyclopedia of Gender and Society; Hirschfeld, Magnus (1868-1935)]

people
type: Collection
type: ConceptGroup
member: Magnus Hirschfeld

key people in gender and society
type: Concept
narrower: Magnus Hirschfeld