Malawi
type: Concept
broader: Southern Africa
definition: Malawi is a landlocked country located in southeastern Africa. A long, narrow country within the Great Rift Valley, it is home to Lake Nyasa (also known as Lake Malawi), the third largest lake in Africa. [Source: Encyclopedia of Global Health; Malawi]

Southern Africa
type: Concept
narrower: Malawi

concepts
type: Collection
type: ConceptGroup
member: Malawi