Meccano
type: Concept
broader: toys
definition: Meccano is a model construction kit made by Meccano Ltd. It was first produced in 1901 by Frank Hornby (1863–1936), who was at that stage a clerk living in Liverpool, England. [Source: Encyclopedia of Play in Today's Society; Meccano]

concepts
type: Collection
type: ConceptGroup
member: Meccano

toys
type: Concept
narrower: Meccano