Minnesota Clerical Test
type: Concept
broader: assessment areas and techniques
definition: The Minnesota Clerical Test (published by The Psychological Corporation) measures perceptual abilities that are commonly used in the performance of various clerical activities. Most often, the MCT is used by employers to select employees who can work with information quickly and accurately, for clerical positions such as clerks, cashiers, tellers, and typists. [Source: Encyclopedia of Measurement and Statistics; Minnesota Clerical Test]

assessment areas and techniques
type: Concept
narrower: Minnesota Clerical Test

concepts
type: Collection
type: ConceptGroup
member: Minnesota Clerical Test