Mississippi
type: Concept
broader: Southeastern United States
definition: Mississippi is a state of superlatives. It is the poorest state in the United States. [Source: Cultural Sociology of Divorce: An Encyclopedia; Mississippi]

Southeastern United States
type: Concept
narrower: Mississippi

concepts
type: Collection
type: ConceptGroup
member: Mississippi