Mississippi State University
type: Concept
broader: institutions studying climate change
definition: Mississippi State University offers several educational options in the areas of meteorology and climatology. The land-grant university, located adjacent to the city of Starkville, was established in 1878. [Source: Encyclopedia of Global Warming & Climate Change; Mississippi State University]

organizations
type: Collection
type: ConceptGroup
member: Mississippi State University

institutions studying climate change
type: Concept
narrower: Mississippi State University