National Health Policy Forum
type: Concept
broader: associations
definition: The National Health Policy Forum (NHPF), created in 1971, is a think tank that provides current research and information to senior staff in the U.S. Congress and executive agencies in an objective format and that offers an opportunity to discuss complex health issues in a private setting. [Source: Encyclopedia of Health Services Research; National Health Policy Forum (NHPF)]

associations
type: Concept
narrower: National Health Policy Forum

organizations
type: Collection
type: ConceptGroup
member: National Health Policy Forum