Oregon State University
type: Concept
broader: institutions studying climate change
definition: OREGON STATE UNIVERSITY (OSU) is a four-year research and degree-granting public university, located in Corvallis, Oregon in the United States. Total student enrollment (undergraduate and graduate) is more than 19,000. [Source: Encyclopedia of Global Warming and Climate Change; Oregon State University]

organizations
type: Collection
type: ConceptGroup
member: Oregon State University

institutions studying climate change
type: Concept
narrower: Oregon State University