Pasteur Institute
type: Concept
broader: organizations and associations
definition: The Pasteur Institute, also known as the Institut Pasteur, is a nonprofit medical research organization dedicated to the study, treatment, and prevention of infectious diseases. Established by Dr. [Source: Encyclopedia of Global Health; Pasteur Institute]

organizations
type: Collection
type: ConceptGroup
member: Pasteur Institute

organizations and associations
type: Concept
narrower: Pasteur Institute