Phillips curve
type: Concept
broader: economic concepts
definition: The term Phillips curve refers to a negative relationship between inflation and unemployment. The Figure 1 illustrates such a relationship. [Source: Encyclopedia of Health Care Management; Phillips Curve]

concepts
type: Collection
type: ConceptGroup
member: Phillips curve

economic concepts
type: Concept
narrower: Phillips curve