Poughkeepsie Plan
type: Concept
broader: concepts in educational reform
definition: The Poughkeepsie Plan was an imaginative educational collaboration between Catholic parishes and local public schools to educate Catholic children at little or no cost to their parents or the parishes. Although named for the city of Poughkeepsie in New York, the Plan was manifested in several different forms in a number of states. [Source: Encyclopedia of Educational Reform and Dissent; Poughkeepsie Plan]

concepts
type: Collection
type: ConceptGroup
member: Poughkeepsie Plan

concepts in educational reform
type: Concept
narrower: Poughkeepsie Plan