Samoan Americans
type: Concept
broader: racial, ethnic, and nationality groups
definition: Samoans in the United States are known as Pacific Islanders. More specifically, they are Polynesians, which is one of the three racial groups in the Pacific Basin. [Source: Encyclopedia of Race, Ethnicity, and Society; Samoan Americans]

concepts
type: Collection
type: ConceptGroup
member: Samoan Americans

racial, ethnic, and nationality groups
type: Concept
narrower: Samoan Americans