Samuel Cotton
type: Concept
broader: political and social movements (North America)
definition: Samuel Cotton was a fearless and articulate spokesman within the United States for the eradication of contemporary slavery in Mauritania and Sudan. Cotton graduated with a B.A. degree in sociology from Lehman College, the City University of New York, in 1993. [Source: Encyclopedia of Activism and Social Justice; Cotton, Samuel (1947–2003)]

people
type: Collection
type: ConceptGroup
member: Samuel Cotton

political and social movements (North America)
type: Concept
narrower: Samuel Cotton