Saturday programs
type: Concept
broader: gifted and talented programs and interventions
definition: Considering the unique needs of gifted students, researchers and educators alike have supported the need for special academic programming for them. As schools are often unable to provide for these needs, special programs are routinely offered outside the normal school setting. [Source: Encyclopedia of Giftedness, Creativity, and Talent; Saturday Programs]

concepts
type: Collection
type: ConceptGroup
member: Saturday programs

gifted and talented programs and interventions
type: Concept
narrower: Saturday programs