Scotland Yard
type: Concept
broader: policing
definition: the investigative division of the London metropolitan police. Scotland Yard has an international reputation for being a highly professional law enforcement organization. [Source: The Concise Dictionary of Crime and Justice; Scotland Yard]

organizations
type: Collection
type: ConceptGroup
member: Scotland Yard

policing
type: Concept
narrower: Scotland Yard