Takeyoshi Kawashima
type: Concept
broader: key people in law and society
definition: Takeyoshi Kawashima was a Japanese professor of civil law and sociology of law at Tokyo University Faculty of Law (TUFL) until his retirement at 60 years of age. He then continued working as a practicing lawyer. [Source: Encyclopedia of Law & Society: American and Global Perspectives; Kawashima, Takeyoshi (1909–1992)]

people
type: Collection
type: ConceptGroup
member: Takeyoshi Kawashima

key people in law and society
type: Concept
narrower: Takeyoshi Kawashima