Eastern Africa
type: Concept
narrower: Tanzania

Tanzania
type: Concept
broader: Eastern Africa
definition: Tanzania is located in east Africa and was born from the unification of Tanganyika and Zanzibar after they became independent from British rule in 1964. The country's population amounts to over 40 million people and lives in poverty. [Source: Encyclopedia of Social Networks; Tanzania]

concepts
type: Collection
type: ConceptGroup
member: Tanzania