Taylor Grazing Act
type: Concept
broader: movements and regulations
definition: The taylor grazing act of 1934 authorized the U.S. Secretary of the Interior to establish and regulate grazing districts on vacant, unappropriated, and unreserved public domain lands deemed “chiefly valuable for grazing,” to issue grazing permits for up to 10 years, and to collect grazing fees. [Source: Encyclopedia of Environment and Society; Taylor Grazing Act (U.S. 1934)]

laws
type: Collection
type: ConceptGroup
member: Taylor Grazing Act

movements and regulations
type: Concept
narrower: Taylor Grazing Act