Ugandan Americans
type: Concept
broader: racial, ethnic, and nationality groups
definition: Ugandan Americans are U.S. citizens whose ancestral origin is in Uganda, a nation in East Africa, with a population in 2007 of an estimated 28.5 million. This entry recounts the portion of Uganda's history relevant to immigration to the United States and the presence of Ugandan Americans. [Source: Encyclopedia of Race, Ethnicity, and Society; Ugandan Americans]

concepts
type: Collection
type: ConceptGroup
member: Ugandan Americans

racial, ethnic, and nationality groups
type: Concept
narrower: Ugandan Americans