United Nations Environmental Summits
type: Concept
broader: organizations (geography)
definition: The United Nations (UN) has laid the foundation for heightened global environmental awareness since the 1970s. A central approach to address these wide-ranging issues, and bring them to the forefront of the international agenda, is through high-level environmental conferences of national leaders. [Source: Encyclopedia of Geography; United Nations Environmental Summits]

concepts
type: Collection
type: ConceptGroup
member: United Nations Environmental Summits

organizations (geography)
type: Concept
narrower: United Nations Environmental Summits