Vitamin D
type: Concept
broader: prevention
definition: THERE IS MOUNTING evidence that vitamin D reduces the risk of cancer and increases the rate of survival. The evidence includes results of observational studies, including ecologic, case–control, and cohort; laboratory studies using cancer cells; and animal studies. [Source: Encyclopedia of Cancer and Society; Vitamin D]

concepts
type: Collection
type: ConceptGroup
member: Vitamin D

prevention
type: Concept
narrower: Vitamin D