Wade Hampton Frost
type: Concept
broader: history and biography
definition: Wade Hampton Frost was a pioneering epidemiologist. Following a distinguished career in the United States Public Health Service, he became the first professor of epidemiology at the Johns Hopkins School of Hygiene and Public Health. [Source: Encyclopedia of Epidemiology; Frost, Wade Hampton (1880–1938)]

people
type: Collection
type: ConceptGroup
member: Wade Hampton Frost

history and biography
type: Concept
narrower: Wade Hampton Frost