Warhammer
type: Concept
broader: board games
definition: Warhammer: The Game of Fantasy Battles, which is often simply referred to as Warhammer, is a tabletop miniature wargame designed and published by Games Workshop. Unlike other tabletop miniature wargames, Warhammer is set in a fantasy universe similar to that found in J.R.R. Tolkein's Middle-earth and Dungeons & Dragons. [Source: Encyclopedia of Play in Today's Society; Warhammer]

board games
type: Concept
narrower: Warhammer

concepts
type: Collection
type: ConceptGroup
member: Warhammer