Wi-Fi
type: Concept
broader: technology and social networking
definition: Wi-Fi is a registered trademark of the Wi-Fi Alliance. Wi-Fi is a method of connecting a device to a network by way of a wireless local area network (WLAN) connection. [Source: Encyclopedia of Social Networks; Wi-Fi]

concepts
type: Collection
type: ConceptGroup
member: Wi-Fi

technology and social networking
type: Concept
narrower: Wi-Fi