Zachariah Walker
type: Concept
broader: key people in race and crime
definition: On August 13, 1911, a mob of allegedly more than 1,000 people lynched a Black man, Zachariah Walker, just outside of the borough of Coatesville, in Chester County, Pennsylvania. Walker had been accused of killing a security guard, who was also a former local police officer, at a Coatesville steel mill 2 days earlier. [Source: Encyclopedia of Race and Crime; Walker, Zachariah (P-1911)]

people
type: Collection
type: ConceptGroup
member: Zachariah Walker

key people in race and crime
type: Concept
narrower: Zachariah Walker