Zulu
type: Concept
broader: cultural/social anthropology
definition: The Zulu (amaZulu) are a Nguni people who live mainly in South Africa's KwaZulu-Natal province, with smaller numbers in Zimbabwe, Zambia, and Mozambique. They form the largest South African ethnic population, estimated at 9 million. [Source: Encyclopedia of African Religion; Zulu]

concepts
type: Collection
type: ConceptGroup
member: Zulu

cultural/social anthropology
type: Concept
narrower: Zulu