aboriginal mothering
type: Concept
broader: motherhood studies
definition: The term mothering was constructed to describe the caregiving role and work of female parents. Aboriginal refers to cultural groups that originated in certain geographic areas prior to the European settlers' arrival in the late 1800s, primarily in North America, New Zealand, and Australia, although there is evidence of some other locations. [Source: Encyclopedia of Motherhood; Aboriginal Mothering]

concepts
type: Collection
type: ConceptGroup
member: aboriginal mothering

motherhood studies
type: Concept
narrower: aboriginal mothering