accounting software
type: Concept
broader: international accounting
definition: Accounting software is a type of computer program that carries out accounting functions. This software has now largely replaced older paper accounting systems. [Source: Encyclopedia of Business in Today's World; Accounting Software]

concepts
type: Collection
type: ConceptGroup
member: accounting software

international accounting
type: Concept
narrower: accounting software