actionable knowledge
type: Concept
broader: knowledge and learning
definition: Actionable knowledge reflects the learning capability of individuals and organizations to connect heterogeneous elements (social, political, economic, technological). The relational understanding generated by actionable knowledge can extend existing modes of knowing and inform future action. [Source: International Encyclopedia of Organization Studies; Actionable Knowledge]

concepts
type: Collection
type: ConceptGroup
member: actionable knowledge

knowledge and learning
type: Concept
narrower: actionable knowledge