aesthetic appreciation
type: Concept
broader: applied anthropology
definition: Aesthetics is the area of philosophy that studies the nature of beauty and art. Aesthetic appreciation, then, is the admiration of beauty, such as valuing the fine arts of music, literature, dance, and visual art. [Source: Encyclopedia of Anthropology; Aesthetic Appreciation]

applied anthropology
type: Concept
narrower: aesthetic appreciation

concepts
type: Collection
type: ConceptGroup
member: aesthetic appreciation