affiliation in animals
type: Concept
broader: psychological processes
definition: Humans are not the only species to form affiliative relationships. Affiliative behavior similar to what is seen in human beings is common throughout nonhuman animals from primates through invertebrates. [Source: Encyclopedia of Human Relationships; Affiliation in Nonhuman Animals]

concepts
type: Collection
type: ConceptGroup
member: affiliation in animals

psychological processes
type: Concept
narrower: affiliation in animals