agenda control
type: Concept
broader: public policy
definition: Agenda control may be defined as the ability to affect the way in which alternatives enter collective decision making. While agenda control is important generally, it plays a special role in the rational-choice-based theory of democratic institutions (or the “new institutionalism”). [Source: The Encyclopedia of Political Science; Agenda Control]

concepts
type: Collection
type: ConceptGroup
member: agenda control

public policy
type: Concept
narrower: agenda control