agents
type: Concept
broader: export/import strategies
definition: Agents are the intermediaries who help to develop and maintain the channels of distribution. Agents arrange for sales between two parties and get paid usually in commission. [Source: Encyclopedia of Business in Today's World; Agents]

concepts
type: Collection
type: ConceptGroup
member: agents

export/import strategies
type: Concept
narrower: agents