aging and older development
type: Concept
narrower: aging parents

aging parents
type: Concept
broader: aging and older development
definition: Throughout our life span, the family is one of the most stable and reliable relationships we experience. Aging parents in America are thriving within the context of their families. [Source: Encyclopedia of Human Development; Aging Parents]

concepts
type: Collection
type: ConceptGroup
member: aging parents