air traffic control
type: Concept
broader: engineering and technological crises
definition: Because a crisis is considered to be an unexpected event of catastrophic proportions, air traffic control would seem to be an occupation with an extremely high potential for such occurrences. It is true that the potential exists. [Source: Encyclopedia of Crisis Management; Air Traffic Control]

concepts
type: Collection
type: ConceptGroup
member: air traffic control

engineering and technological crises
type: Concept
narrower: air traffic control