apocalypse
type: Concept
broader: religion
definition: Apocalypse is defined as a prophetic revelation. It is a description of the battle of Armageddon, the battle of good versus evil, as revealed in the book of Revelation of the New Testament of the Bible. [Source: Encyclopedia of Death and the Human Experience; Apocalypse]

concepts
type: Collection
type: ConceptGroup
member: apocalypse

religion
type: Concept
narrower: apocalypse