architecture and organizations
type: Concept
broader: issues in organizational structure
definition: The discourses of architecture, as organization studies, have been heavily influenced by what, for lack of a better term, has been called postmodernism. In fact, many of the key philosophical concepts were translated into and discussed in architecture before they traveled to other disciplines such as organization studies. [Source: International Encyclopedia of Organization Studies; Architecture and Organizations]

concepts
type: Collection
type: ConceptGroup
member: architecture and organizations

issues in organizational structure
type: Concept
narrower: architecture and organizations