arts-based research
type: Concept
broader: inquiry and research
definition: Arts-based research is an approach to curriculum inquiry that looks to the arts instead of to the social sciences for its investigational and representational strategies and its epistemological premises. This form of inquiry has been used to explore a wide range of curriculum commonplaces, such as curriculum guides, textbooks, and other materials; elements of the hidden curriculum; the curriculum-in-use; and so forth. [Source: Encyclopedia of Curriculum Studies; Arts-Based Research]

methods
type: Collection
type: ConceptGroup
member: arts-based research

inquiry and research
type: Concept
narrower: arts-based research