audit society
type: Concept
broader: public administration
definition: The concept of “audit society” refers primarily to a logic at work in regulatory and managerial processes and to tendencies, rather than to an epochal state or condition. In this context, an audit refers to a systematic assessment of institutional performance against agreed criteria and standards. [Source: International Encyclopedia of Political Science; Audit Society]

concepts
type: Collection
type: ConceptGroup
member: audit society

public administration
type: Concept
narrower: audit society