audition
type: Concept
narrower: auditory frequency selectivity

auditory frequency selectivity
type: Concept
broader: audition
definition: Our world is filled with acoustic energy. Sound waves radiate from different sources, bouncing off walls, floors, and other objects, and intermingling before finally reaching our ears. [Source: Encyclopedia of Perception; Auditory Frequency Selectivity]

concepts
type: Collection
type: ConceptGroup
member: auditory frequency selectivity