automobility
type: Concept
broader: social geography
definition: Automobility refers to the economic, social, and spatial impacts of the automobile. From its modest roots as a “horseless carriage,” a plaything for affluent Europeans, the automobile emerged to become arguably the defining technology of the 20th century. [Source: Encyclopedia of Geography; Automobility]

concepts
type: Collection
type: ConceptGroup
member: automobility

social geography
type: Concept
narrower: automobility