banshees
type: Concept
broader: unworldly entities and events
definition: The banshee is the Irish supernatural deathmessenger par excellence. Regarded as a family messenger of death, this female spirit is said to cry when a member of Irish family is about to die, at home or abroad. [Source: Encyclopedia of Death and the Human Experience; Banshee]

concepts
type: Collection
type: ConceptGroup
member: banshees

unworldly entities and events
type: Concept
narrower: banshees