animals
type: Concept
narrower: birds

birds
type: Concept
broader: animals
definition: Birds are held in high regard in African religion because of their ability to cross the barriers among humans, spirits, space, and time. As with many African religious systems, this belief is based on observable phenomena. [Source: Encyclopedia of African Religion; Birds]

concepts
type: Collection
type: ConceptGroup
member: birds