blue sky laws
type: Concept
broader: finance ethics
definition: Blue sky laws refers to each state’s set of securities laws and regulations. Every state, plus the District of Columbia, Guam, Puerto Rico, and the U.S. Virgin Islands, has its own securities laws. [Source: Encyclopedia of the First Amendment; Blue Sky Laws]

concepts
type: Collection
type: ConceptGroup
member: blue sky laws

finance ethics
type: Concept
narrower: blue sky laws