breakfast in the classroom
type: Concept
broader: school nutrition
definition: New models of delivering the national School Breakfast Program (SBP) have emerged over the past several years as a way to reduce stigma and address scheduling issues associated with school breakfast as well as increase participation in this school health program. One such breakfast delivery model is called breakfast in the classroom (BIC). [Source: Encyclopedia of School Health; Breakfast in the Classroom]

concepts
type: Collection
type: ConceptGroup
member: breakfast in the classroom

school nutrition
type: Concept
narrower: breakfast in the classroom