brown lung
type: Concept
broader: work-related crimes
definition: Brown lung, or byssinosis, is a form of pneumoconiosis that develops from inhalation of cotton dust. Other forms of pneumoconiosis include black lung (from coal dust), silicosis (from crystalline silica dust), and asbestosis (from asbestos fibers). [Source: Encyclopedia of White-Collar and Corporate Crime; Brown Lung]

concepts
type: Collection
type: ConceptGroup
member: brown lung

work-related crimes
type: Concept
narrower: brown lung