business failure
type: Concept
broader: entrepreneurial decision making
definition: I was further out than you thought,And not waving but drowning—Stevie SmithNew ventures are invariably founded with a sense of optimism for the future, whether justified by preliminary research or not. Although most of our management thinking concerns success, it is equally important to consider the consequences of the statistically likely outcome that the venture will not be successful or that the founders will not necessarily share in the firm's successes.Definitions of failure usually identify discontinuance and financial loss as prime aspects, frequently identified as bankruptcy or insolvency depending upon the firm's legal status. [Source: Encyclopedia of New Venture Management; Business Failure]

concepts
type: Collection
type: ConceptGroup
member: business failure

entrepreneurial decision making
type: Concept
narrower: business failure