assessment areas and techniques
type: Concept
narrower: business simulations

business simulations
type: Concept
broader: assessment areas and techniques
definition: The term business simulations refers to exercises that represent processes involved in the production and delivery of goods and services. These exercises may be used to study the processes themselves, to enhance their teaching, or to assess proficiency in their management. [Source: Encyclopedia of Career Development; Business Simulations]

concepts
type: Collection
type: ConceptGroup
member: business simulations