calcium disorders of aging
type: Concept
broader: diseases and medical conditions
definition: It is important to recognize calcium disorders when they present in older patients. Hypercalcemia, or elevated calcium levels, is seen more commonly than hypocalcemia, or low calcium levels. [Source: Encyclopedia of Health & Aging; Calcium Disorders of Aging]

concepts
type: Collection
type: ConceptGroup
member: calcium disorders of aging

diseases and medical conditions
type: Concept
narrower: calcium disorders of aging