career strategy
type: Concept
broader: decision making and career development
definition: A career strategy is any behavior, activity, or experience designed to help a person meet career goals. A career strategy represents a conscious choice by an individual as to the type of investment he or she is willing to make in attempting to reach career objectives. [Source: Encyclopedia of Career Development; Career Strategy]

concepts
type: Collection
type: ConceptGroup
member: career strategy

decision making and career development
type: Concept
narrower: career strategy